DNC+

Vibrational and/or electronic energy levels

Data compiled by: Marilyn E. Jacox

State:   X

Vib.
sym.
 No.   Approximate
 type of mode
 cm-1   Med.   Method   References

Σ+ 1 ND stretch 2664.9 Ne IR Forney, Thompson, et al., 1992
3 NC stretch 2028.1 Ne IR Forney, Thompson, et al., 1992

References

Forney, Thompson, et al., 1992
Forney, D.; Thompson, W.E.; Jacox, M.E., The vibrational spectra of molecular ions isolated in solid neon. IX. HCN+, HNC+, and CN-, J. Chem. Phys., 1992, 97, 3, 1664, https://doi.org/10.1063/1.463963 . [all data]