AlD2

Vibrational and/or electronic energy levels

Data compiled by: Marilyn E. Jacox

State:   X

Vib.
sym.
 No.   Approximate
 type of mode
 cm-1   Med.   Method   References

a1 1 AlD s-stretch 1296.0 Ne IR Wang, Andrews, et al., 2003
1 AlD s-stretch 1278.9 Ar IR Chertihin and Andrews, 1993
Pullumbi, Mijoule, et al., 1994
1 AlD s-stretch 1275 w Kr IR Parnis and Ozin, 1989
1 AlD s-stretch 1293.1 o-D2 IR Andrews and Wang, 2004
1 AlD s-stretch 1293.1 D2 IR Andrews and Wang, 2003
Wang, Andrews, et al., 2003
Andrews and Wang, 2004
2 Bend 554.1 Ar IR Pullumbi, Mijoule, et al., 1994
2 Bend 560 m Kr IR Parnis and Ozin, 1989
2 Bend 560.3 D2 IR Wang, Andrews, et al., 2003
Andrews and Wang, 2004
b2 3 AlD a-stretch 1340.4 Ne IR Wang, Andrews, et al., 2003
Andrews and Wang, 2004
3 AlD a-stretch 1325.0 Ar IR Chertihin and Andrews, 1993
Pullumbi, Mijoule, et al., 1994
3 AlD a-stretch 1320 w Kr IR Parnis and Ozin, 1989
3 AlD a-stretch 1337.2 o-D2 IR Andrews and Wang, 2004
3 AlD a-stretch 1337.2 D2 IR Andrews and Wang, 2003
Wang, Andrews, et al., 2003
Andrews and Wang, 2004

References

Wang, Andrews, et al., 2003
Wang, X.; Andrews, L.; Tam, S.; DeRose, M.E.; Fajardo, M.E., Infrared Spectra of Aluminum Hydrides in Solid Hydrogen: Al, J. Am. Chem. Soc., 2003, 125, 30, 9218, https://doi.org/10.1021/ja0353560 . [all data]

Chertihin and Andrews, 1993
Chertihin, G.V.; Andrews, L., Reactions of pulsed-laser ablated aluminum atoms with hydrogen: infrared spectra of aluminum hydride (AlH, AlH2, AlH3, and Al2H2) species, J. Phys. Chem., 1993, 97, 40, 10295, https://doi.org/10.1021/j100142a007 . [all data]

Pullumbi, Mijoule, et al., 1994
Pullumbi, P.; Mijoule, C.; Manceron, L.; Bouteiller, Y., Aluminium, gallium and indium dihydrides. An IR matrix isolation and ab initio study, Chem. Phys., 1994, 185, 1, 13, https://doi.org/10.1016/0301-0104(94)00110-3 . [all data]

Parnis and Ozin, 1989
Parnis, J.M.; Ozin, G.A., Photochemical reactions of matrix-isolated aluminum atoms with methane and molecular hydrogen. 2. Molecular hydrogen, J. Phys. Chem., 1989, 93, 4, 1215, https://doi.org/10.1021/j100341a011 . [all data]

Andrews and Wang, 2004
Andrews, L.; Wang, X., Infrared Spectra of Dialanes in Solid Hydrogen, J. Phys. Chem. A, 2004, 108, 19, 4202, https://doi.org/10.1021/jp037792e . [all data]

Andrews and Wang, 2003
Andrews, L.; Wang, X., The Infrared Spectrum of Al2H6 in Solid Hydrogen, Science, 2003, 299, 5615, 2049, https://doi.org/10.1126/science.1082456 . [all data]