DKr2+

Vibrational and/or electronic energy levels

Data compiled by: Marilyn E. Jacox

State:   X

Vib.
sym.
 No.   Approximate
 type of mode
 cm-1   Med.   Method   References

Σg+ 1 Sym. stretch 165 T Kr IR Kunttu and Seetula, 1994
Fridgen, Zhang, et al., 2000
Σu+ 3 Asym. stretch 625 T Ar IR Fridgen and Parnis, 1998
3 Asym. stretch 606 m Kr IR Bondybey and Pimentel, 1972
Kunttu and Seetula, 1994
Fridgen, Zhang, et al., 2000

References

Kunttu and Seetula, 1994
Kunttu, H.M.; Seetula, J.A., Photogeneration of ionic species in Ar, Kr and Xe matrices doped with HCl, HBr and HI, Chem. Phys., 1994, 189, 2, 273, https://doi.org/10.1016/0301-0104(94)00273-8 . [all data]

Fridgen, Zhang, et al., 2000
Fridgen, T.D.; Zhang, X.K.; Parnis, J.M.; March, R.E., Isomerization and Fragmentation Products of CH, J. Phys. Chem. A, 2000, 104, 16, 3487, https://doi.org/10.1021/jp993162u . [all data]

Fridgen and Parnis, 1998
Fridgen, T.D.; Parnis, J.M., Electron bombardment matrix isolation of Rg/Rg´/methanol mixtures (Rg= Ar, Kr, Xe): Fourier-transform infrared characterization of the proton-bound dimers Kr[sub 2]H[sup +], Xe[sub 2]H[sup +], (ArHKr)[sup +] and (ArHXe)[sup +] in Ar matrices and (KrHXe)[sup +] and Xe[sub 2]H[sup +] in Kr matrices, J. Chem. Phys., 1998, 109, 6, 2155, https://doi.org/10.1063/1.476728 . [all data]

Bondybey and Pimentel, 1972
Bondybey, V.E.; Pimentel, G.C., Infrared Absorptions of Interstitial Hydrogen Atoms in Solid Argon and Krypton, J. Chem. Phys., 1972, 56, 8, 3832, https://doi.org/10.1063/1.1677786 . [all data]