DCF+

Vibrational and/or electronic energy levels

Data compiled by: Marilyn E. Jacox

State:   X

Vib.
sym.
 No.   Approximate
 type of mode
 cm-1   Med.   Method   References

a' CF stretch 1369 m Ar IR Andrews and Prochaska, 1979

References

Andrews and Prochaska, 1979
Andrews, L.; Prochaska, F.T., Infrared spectra of the CH2F2+, CHF2+, CHF+, and FH-- (CHF)- molecular ions in solid argon, J. Chem. Phys., 1979, 70, 10, 4714, https://doi.org/10.1063/1.437259 . [all data]