GaOD

Vibrational and/or electronic energy levels

Data compiled by: Marilyn E. Jacox

State:   X

Vib.
sym.
 No.   Approximate
 type of mode
 cm-1   Med.   Method   References

Σ+ 1 OD stretch 2720.3 Ar IR Hauge, Kauffman, et al., 1980
Macrae and Downs, 2004
Wang and Andrews, 2007
3 GaO stretch 595.9 Ar IR Hauge, Kauffman, et al., 1980
Macrae and Downs, 2004
Wang and Andrews, 2007

References

Hauge, Kauffman, et al., 1980
Hauge, R.H.; Kauffman, J.W.; Margrave, J.L., Infrared matrix-isolation studies of the interactions and reactions of Group 3A metal atoms with water, J. Am. Chem. Soc., 1980, 102, 19, 6005, https://doi.org/10.1021/ja00539a005 . [all data]

Macrae and Downs, 2004
Macrae, V.A.; Downs, A.J., Matrix studies of the thermal and photolytic reactions of Ga vapour species with H2O: formation and characterisation of the adducts Ga«65533»OH2 and Ga2«65533»OH2 and the photoproducts HGaOH, GaOH and Ga(«65533»-H)(«65533»-OH)GaElectronic supplementary information (ESI) available: UV?vis spectra of an Ar matrix containing Ga and H2O (Fig. S1); calculated and observed IR spectral details for Ga(«65533»-H)(«65533»-OH)Ga (Table S1). See http://www.rsc.org/suppdata/cp/b4/b405298f/, Phys. Chem. Chem. Phys., 2004, 6, 19, 4571, https://doi.org/10.1039/b405298f . [all data]

Wang and Andrews, 2007
Wang, X.; Andrews, L., Infrared Spectroscopic Observation of the Group 13 Metal Hydroxides, M(OH), J. Phys. Chem. A, 2007, 111, 10, 1860, https://doi.org/10.1021/jp066390e . [all data]