SbD2

Vibrational and/or electronic energy levels

Data compiled by: Marilyn E. Jacox

State:   X

Vib.
sym.
 No.   Approximate
 type of mode
 cm-1   Med.   Method   References

a1 1 SbD2 s-stretch 1352.0 Ne IR Wang, Souter, et al., 2003
1 SbD2 s-stretch 1341.8 Ar IR Wang, Souter, et al., 2003
1 SbD2 s-stretch 1345.8 D2 IR Wang, Souter, et al., 2003
b2 3 SbD2 a-stretch 1349.4 Ne IR Wang, Souter, et al., 2003
3 SbD2 a-stretch 1337.6 Ar IR Wang, Souter, et al., 2003
3 SbD2 a-stretch 1341.9 D2 IR Wang, Souter, et al., 2003

References

Wang, Souter, et al., 2003
Wang, X.; Souter, P.F.; Andrews, L., Infrared Spectra of Antimony and Bismuth Hydrides in Solid Matrixes, J. Phys. Chem. A, 2003, 107, 21, 4244, https://doi.org/10.1021/jp034379y . [all data]