ND2+

Vibrational and/or electronic energy levels

Data compiled by: Marilyn E. Jacox

State:   a

Vib.
sym.
 No.   Approximate
 type of mode
 cm-1   Med.   Method   References

a1 1 Sym. stretch 2210 ± 50 gas PE Dunlavey, Dyke, et al., 1980
2 Bend 978.4 ± 1.2 gas PE TPE Dunlavey, Dyke, et al., 1980
Willitsch, Dyke, et al., 2004

State:   X

Vib.
sym.
 No.   Approximate
 type of mode
 cm-1   Med.   Method   References

Πu 2 Bend 330 ± 30 H gas PE Dunlavey, Dyke, et al., 1980

References

Dunlavey, Dyke, et al., 1980
Dunlavey, S.J.; Dyke, J.M.; Jonathan, N.; Morris, A., Vacuum ultraviolet photoelectron spectroscopy of transient species. Part 11. The NH2(X(2)B1) radical, Mol. Phys., 1980, 39, 1121. [all data]

Willitsch, Dyke, et al., 2004
Willitsch, S.; Dyke, J.M.; Merkt, F., Rotationally resolved photoelectron spectrum of the lowest singlet electronic state of NH, Mol. Phys., 2004, 102, 14-15, 1543, https://doi.org/10.1080/00268970410001725855 . [all data]