DC6N

Vibrational and/or electronic energy levels

Data compiled by: Marilyn E. Jacox

State:   A

 Energy
 (cm-1
 Med.   Transition   λmin
 (nm)
 λmax
 (nm)

References

To = 21282.10 ± 0.05 gas A-X 431 471 Vaizert, Motylewski, et al., 2001
To = 21239 ± 10 Ne A-X 431 471 Vaizert, Motylewski, et al., 2001

Vib.
sym.
 No.   Approximate
 type of mode
 cm-1   Med.   Method   References

Σ+ CC stretch 1926.0 gas CR Vaizert, Motylewski, et al., 2001
CC stretch 1935 ± 15 Ne AB Vaizert, Motylewski, et al., 2001
Π Bend 172 H T Ne AB Vaizert, Motylewski, et al., 2001

Vaizert, Motylewski, et al., 2001
Vaizert, O.; Motylewski, T.; Wyss, M.; Riaplov, E.; Linnartz, H.; Maier, J.P., The A [sup 3]Σ[sup -]--X [sup 3]Σ[sup -] electronic transition of HC[sub 6]N, J. Chem. Phys., 2001, 114, 18, 7918, https://doi.org/10.1063/1.1361254 . [all data]