C6D5OD+

Vibrational and/or electronic energy levels

Data compiled by: Marilyn E. Jacox

State:   B

 Energy
 (cm-1
 Med.   Transition   λmin
 (nm)
 λmax
 (nm)

References

gas B-X 425 442 LeClaire, Anand, et al., 1997

Vib.
sym.
 No.   Approximate
 type of mode
 cm-1   Med.   Method   References

234 T gas PRI LeClaire, Anand, et al., 1997

LeClaire, Anand, et al., 1997
LeClaire, J.E.; Anand, R.; Johnson, P.M., Photoinduced Rydberg ionization spectroscopy of phenol: The structure and assignment of the B-state of the cation, J. Chem. Phys., 1997, 106, 17, 6785, https://doi.org/10.1063/1.473677 . [all data]