DC9D

Vibrational and/or electronic energy levels

Data compiled by: Marilyn E. Jacox

State:   A

 Energy
 (cm-1
 Med.   Transition   λmin
 (nm)
 λmax
 (nm)

References

To = 17262.5 gas A-X 519 580 Ball, McCarthy, et al., 1999
Ball, McCarthy, et al., 2000
To = 17292 ± 5 Ne A-X 432 581 Fulara, Freivogel, et al., 1995
To = 17236 ± 5 Ne A-X 432 581 Fulara, Freivogel, et al., 1995

Vib.
sym.
 No.   Approximate
 type of mode
 cm-1   Med.   Method   References

Σg+ 3 CC s-stretch 1968.4 ± 0.2 gas CR Ball, McCarthy, et al., 1999
Ball, McCarthy, et al., 2000
3 CC s-stretch 1966 ± 5 Ne AB Fulara, Freivogel, et al., 1995

Ball, McCarthy, et al., 1999
Ball, C.D.; McCarthy, M.C.; Thaddeus, P., Laser Spectroscopy of the Carbon Chains HC[TINF]7[/TINF]H and HC[TINF]9[/TINF]H, Astrophys. J., 1999, 523, 1, L89, https://doi.org/10.1086/312255 . [all data]

Ball, McCarthy, et al., 2000
Ball, C.D.; McCarthy, M.C.; Thaddeus, P., Cavity ringdown spectroscopy of the linear carbon chains HC[sub 7]H, HC[sub 9]H, HC[sub 11]H, and HC[sub 13]H, J. Chem. Phys., 2000, 112, 23, 10149, https://doi.org/10.1063/1.481655 . [all data]

Fulara, Freivogel, et al., 1995
Fulara, J.; Freivogel, P.; Forney, D.; Maier, J.P., Electronic absorption spectra of linear carbon chains in neon matrices. III. HC2n+1H, J. Chem. Phys., 1995, 103, 20, 8805, https://doi.org/10.1063/1.470069 . [all data]