B2D6+

Vibrational and/or electronic energy levels

Data compiled by: Marilyn E. Jacox

State:   D

 Energy
 (cm-1
 Med.   Transition   λmin
 (nm)
 λmax
 (nm)

References

To = 38650 ± 100 gas Lloyd and Lynaugh, 1970

Vib.
sym.
 No.   Approximate
 type of mode
 cm-1   Med.   Method   References

ag 1 BDt stretch 1500 ± 80 gas PE Lloyd and Lynaugh, 1970
650 ± 160 gas PE Lloyd and Lynaugh, 1970

State:   C

 Energy
 (cm-1
 Med.   Transition   λmin
 (nm)
 λmax
 (nm)

Tx = 28000 ± 100 gas Lloyd and Lynaugh, 1970

State:   B

 Energy
 (cm-1
 Med.   Transition   λmin
 (nm)
 λmax
 (nm)

Tx = 21300 ± 180 gas Lloyd and Lynaugh, 1970

State:   A

 Energy
 (cm-1
 Med.   Transition   λmin
 (nm)
 λmax
 (nm)

To = 11860 ± 250 gas Lloyd and Lynaugh, 1970

Vib.
sym.
 No.   Approximate
 type of mode
 cm-1   Med.   Method   References

ag 1500 ± 300 gas PE Lloyd and Lynaugh, 1970

State:   X

Vib.
sym.
 No.   Approximate
 type of mode
 cm-1   Med.   Method   References

ag 800 ± 120 gas PE Lloyd and Lynaugh, 1970

Lloyd and Lynaugh, 1970
Lloyd, D.R.; Lynaugh, N., Photoelectron studies of boron compounds. I. Diborane, borazine and B-trifluoroborazine, Phil. Trans. Roy. Soc. (London), 1970, A268, 97. [all data]