1,2,4,5-C6D2F4+

Vibrational and/or electronic energy levels

Data compiled by: Marilyn E. Jacox

State:   B

 Energy
 (cm-1
 Med.   Transition   λmin
 (nm)
 λmax
 (nm)

References

To = 24400 Ne B-X 370 465 Bondybey, English, et al., 1980

Vib.
sym.
 No.   Approximate
 type of mode
 cm-1   Med.   Method   References

ag 2 1531 Ne LF Bondybey, English, et al., 1980
3 1383 T Ne LF Bondybey, English, et al., 1980
4 722 Ne LF Bondybey, English, et al., 1980
5 466 Ne LF Bondybey, English, et al., 1980
6 276 Ne LF Bondybey, English, et al., 1980

State:   X

Vib.
sym.
 No.   Approximate
 type of mode
 cm-1   Med.   Method   References

ag 2 1542 Ne LF Bondybey, English, et al., 1980
3 1472 Ne LF Bondybey, English, et al., 1980
4 706 Ne LF Bondybey, English, et al., 1980
5 480 Ne LF Bondybey, English, et al., 1980
6 286 Ne LF Bondybey, English, et al., 1980

Bondybey, English, et al., 1980
Bondybey, V.E.; English, J.H.; Miller, T.A., Laser-induced fluorescence spectra of several nonsymmetrical fluorobenzene radical cations in solid Ne, J. Mol. Spectrosc., 1980, 81, 2, 455, https://doi.org/10.1016/0022-2852(80)90205-2 . [all data]