C6D2+

Vibrational and/or electronic energy levels

Data compiled by: Marilyn E. Jacox

State:   A

 Energy
 (cm-1
 Med.   Transition   λmin
 (nm)
 λmax
 (nm)

References

To = 16686.51 gas Sinclair, Pfluger, et al., 1999

Sinclair, Pfluger, et al., 1999
Sinclair, W.E.; Pfluger, D.; Linnartz, H.; Maier, J.P., Rotationally resolved A [sup 2]Π[sub g]←X [sup 2]Π[sub u] electronic spectrum of triacetylene cation by frequency modulation absorption spectroscopy, J. Chem. Phys., 1999, 110, 1, 296, https://doi.org/10.1063/1.478065 . [all data]