CD3CCBr+

Vibrational and/or electronic energy levels

Data compiled by: Marilyn E. Jacox

State:   A

 Energy
 (cm-1
 Med.   Transition   λmin
 (nm)
 λmax
 (nm)

References

To = 21824 gas A-X 440 525 Klapstein, Kuhn, et al., 1986

Vib.
sym.
 No.   Approximate
 type of mode
 cm-1   Med.   Method   References

a1 5 CBr stretch 373 ± 2 gas EF LF Klapstein, Kuhn, et al., 1986
e 10 CBr bend 195 H gas EF LF Klapstein, Kuhn, et al., 1986

State:   X

Vib.
sym.
 No.   Approximate
 type of mode
 cm-1   Med.   Method   References

a1 2 CC stretch 2011 ± 2 gas EF Klapstein, Kuhn, et al., 1986
5 CBr stretch 462 ± 2 gas EF Klapstein, Kuhn, et al., 1986
e 10 CBr bend 243 H gas EF Klapstein, Kuhn, et al., 1986

Klapstein, Kuhn, et al., 1986
Klapstein, D.; Kuhn, R.; Maier, J.P.; Ochsner, M.; Wyttenbach, T., Spectroscopic characterization of organic cations: emission and laser-excitation spectra of rotationally cooled CH3«58872»C«58876»C«58872»X+, X «58872» Cl, Br, Chem. Phys., 1986, 101, 1, 133, https://doi.org/10.1016/0301-0104(86)87029-X . [all data]