C5D

Vibrational and/or electronic energy levels

Data compiled by: Marilyn E. Jacox

State:   B

 Energy
 (cm-1
 Med.   Transition   λmin
 (nm)
 λmax
 (nm)

References

To = 20587 gas Ding, Pino, et al., 2002

State:   A

 Energy
 (cm-1
 Med.   Transition   λmin
 (nm)
 λmax
 (nm)

To = 18824 gas Ding, Pino, et al., 2002

Vib.
sym.
 No.   Approximate
 type of mode
 cm-1   Med.   Method   References

Π 9 478 gas MPI Ding, Pino, et al., 2002

State:   X

Vib.
sym.
 No.   Approximate
 type of mode
 cm-1   Med.   Method   References

Σ+ 1 CD stretch 2535.1 Ne IR Wu, Chen, et al., 2009
3 CC stretch 1917.9 Ne IR Wu, Chen, et al., 2009

Ding, Pino, et al., 2002
Ding, H.; Pino, T.; Guthe, F.; Maier, J.P., Electronic spectra of the C[sub 2n+1]H (n=2--4) radicals in the gas phase, J. Chem. Phys., 2002, 117, 18, 8362, https://doi.org/10.1063/1.1511183 . [all data]

Wu, Chen, et al., 2009
Wu, Y.-J.; Chen, H.-F.; Camacho, C.; Sitek, H.A.; Hsu, S.-C.; Lin, M.-Y.; Chou, S.-L.; Ogilvie, J.F.; Cheng, B.-M., FORMATION AND IDENTIFICATION OF INTERSTELLAR MOLECULE LINEAR C, Astrophys. J., 2009, 701, 1, 8, https://doi.org/10.1088/0004-637X/701/1/8 . [all data]