t-CDClCDO
- Formula: C2D2ClO
- Molecular weight: 79.502

Vibrational and/or electronic energy levels

Data compiled by: Marilyn E. Jacox
State: B
Energy (cm-1) |
Med. | Transition | λmin (nm) |
λmax (nm) |
References | ||
---|---|---|---|---|---|---|---|
To = 29068 | gas | B-X | 339 | 473 | Inomata, Bridier, et al., 2001 | ||
Vib. sym. |
No. | Approximate type of mode |
cm-1 | Med. | Method | References | |
---|---|---|---|---|---|---|---|
3 | CO stretch | 1521 | gas | LF | Inomata, Bridier, et al., 2001 | ||
4 | CD rock | 939 | gas | LF | Inomata, Bridier, et al., 2001 | ||
5 | CD rock | 842 | gas | LF | Inomata, Bridier, et al., 2001 | ||
8 | CCO bend | 419 | gas | LF | Inomata, Bridier, et al., 2001 | ||
State: X
Vib. sym. |
No. | Approximate type of mode |
cm-1 | Med. | Method | References | |
---|---|---|---|---|---|---|---|
a' | 3 | CO stretch | 1568 | gas | LF | Inomata, Bridier, et al., 2001 | |
4 | CD rock | 965 | gas | LF | Inomata, Bridier, et al., 2001 | ||
8 | CCO bend | 481 | gas | LF | Inomata, Bridier, et al., 2001 | ||

References

Inomata, Bridier, et al., 2001
Inomata, S.; Bridier, I.; Furubayashi, M.; Imamura, T.; Inoue, G.; Yamaguchi, M.; Washida, N.,
Laser-Induced Fluorescence of the CHClCHO Radical and Reaction of Oxygen Atoms with Halogenated Ethylenes,
J. Phys. Chem. A, 2001, 105, 32, 7559, https://doi.org/10.1021/jp011253x
. [all data]