D2NO+

Vibrational and/or electronic energy levels

Data compiled by: Marilyn E. Jacox

State:   A

 Energy
 (cm-1
 Med.   Transition   λmin
 (nm)
 λmax
 (nm)

References

To = 19440 ± 160 gas Baker, Butcher, et al., 1990

State:   a

 Energy
 (cm-1
 Med.   Transition   λmin
 (nm)
 λmax
 (nm)

To = 13880 ± 160 gas Baker, Butcher, et al., 1990

State:   X

Vib.
sym.
 No.   Approximate
 type of mode
 cm-1   Med.   Method   References

a1 2 NO stretch 1710 ± 60 gas PE Baker, Butcher, et al., 1990

Baker, Butcher, et al., 1990
Baker, J.; Butcher, V.; Dyke, J.M.; Morris, A., J. Chem. Soc., 1990, Faraday Trans. 86, 3843. [all data]