t-N2D2+

Vibrational and/or electronic energy levels

Data compiled by: Marilyn E. Jacox

State:   B

 Energy
 (cm-1
 Med.   Transition   λmin
 (nm)
 λmax
 (nm)

References

To = 40990 ± 160 gas Frost, Lee, et al., 1976

Vib.
sym.
 No.   Approximate
 type of mode
 cm-1   Med.   Method   References

ag 3 NND bend 960 ± 30 gas PE Frost, Lee, et al., 1976

State:   A

 Energy
 (cm-1
 Med.   Transition   λmin
 (nm)
 λmax
 (nm)

To = 36310 ± 160 gas Frost, Lee, et al., 1976

Vib.
sym.
 No.   Approximate
 type of mode
 cm-1   Med.   Method   References

ag 2 NN stretch 1110 ± 30 gas PE Frost, Lee, et al., 1976

State:   X

Vib.
sym.
 No.   Approximate
 type of mode
 cm-1   Med.   Method   References

ag 3 NND bend 1020 ± 30 gas PE Frost, Lee, et al., 1976

Frost, Lee, et al., 1976
Frost, D.C.; Lee, S.T.; McDowell, C.A.; Westwood, N.P.C., The photoelectron spectra of diazene, diazene-d2, trans-methyldiazene, J. Chem. Phys., 1976, 64, 4719. [all data]