KrXeD

Vibrational and/or electronic energy levels

Data compiled by: Marilyn E. Jacox

State:   A

 Energy
 (cm-1
 Med.   Transition   λmin
 (nm)
 λmax
 (nm)

References

To = 50170 ± 10 Kr Kraas and Gurtler, 1991
Kunz, McCaffrey, et al., 1991
Kraas and Gurtler, 1991, 2
Tx = 46150 Kr Kraas and Gurtler, 1991

Vib.
sym.
 No.   Approximate
 type of mode
 cm-1   Med.   Method   References

580 ± 10 Kr AB Kraas and Gurtler, 1991
Kraas and Gurtler, 1991, 2

Kraas and Gurtler, 1991
Kraas, M.; Gurtler, P., Rare-gas-exciplex-hydrides in rare-gas matrices: luminecence spectra and radiative lifetimes, Chem. Phys. Lett., 1991, 183, 3-4, 264, https://doi.org/10.1016/0009-2614(91)80061-2 . [all data]

Kunz, McCaffrey, et al., 1991
Kunz, H.; McCaffrey, J.B.; Chergui, M.; Schriever, R.; Unal, O.; Stepanenko, V.; Schwentner, N., Rydberg series of charge-transfer excitations: Cl and H in rare gas crystals, J. Chem. Phys., 1991, 95, 3, 1466, https://doi.org/10.1063/1.461061 . [all data]

Kraas and Gurtler, 1991, 2
Kraas, M.; Gurtler, P., Xenon hydrides and deuterides in argon matrices, Chem. Phys. Lett., 1991, 187, 5, 527, https://doi.org/10.1016/0009-2614(91)80294-8 . [all data]