Ar2D

Vibrational and/or electronic energy levels

Data compiled by: Marilyn E. Jacox

State:   A

 Energy
 (cm-1
 Med.   Transition   λmin
 (nm)
 λmax
 (nm)

References

Tx = 60350 Ar Kraas and Gurtler, 1990

Kraas and Gurtler, 1990
Kraas, M.; Gurtler, P., Emission and excitation spectra of rare gas hydride trimers in rare gas matrices, Chem. Phys. Lett., 1990, 174, 5, 396, https://doi.org/10.1016/S0009-2614(90)87168-Q . [all data]