DBS+

Vibrational and/or electronic energy levels

Data compiled by: Marilyn E. Jacox

State:   A

 Energy
 (cm-1
 Med.   Transition   λmin
 (nm)
 λmax
 (nm)

References

To = 19913 gas A-X 462 646 King, Klapstein, et al., 1985

Vib.
sym.
 No.   Approximate
 type of mode
 cm-1   Med.   Method   References

Σ+ 1 BD stretch 1706.6 ± 0.4 gas EF King, Klapstein, et al., 1985
3 BS stretch 1011.1 ± 0.4 gas EF King, Klapstein, et al., 1985

State:   X

Vib.
sym.
 No.   Approximate
 type of mode
 cm-1   Med.   Method   References

Σ+ 1 BD stretch 2071.1 ± 0.4 gas EF King, Klapstein, et al., 1985
3 BS stretch 933.9 ± 0.4 gas EF King, Klapstein, et al., 1985

King, Klapstein, et al., 1985
King, M.A.; Klapstein, D.; Kuhn, R.; Maier, J.P.; Kroto, H.W., Mol. Phys., 1985, 56, 4, 871, https://doi.org/10.1080/00268978500102771 . [all data]