CuOD

Vibrational and/or electronic energy levels

Data compiled by: Marilyn E. Jacox

State:   B

 Energy
 (cm-1
 Med.   Transition   λmin
 (nm)
 λmax
 (nm)

References

To = 18422.335 gas B-X 500 560 Trkula and Harris, 1983
Jarman, Fernando, et al., 1990
Tao, Mukarakate, et al., 2007

Vib.
sym.
 No.   Approximate
 type of mode
 cm-1   Med.   Method   References

a' 2 Bend 409.3 gas LF Tao, Mukarakate, et al., 2007

State:   A

 Energy
 (cm-1
 Med.   Transition   λmin
 (nm)
 λmax
 (nm)

To = 15911.095 ± 0.003 gas A-X Jarman, Fernando, et al., 1991

State:   X

Vib.
sym.
 No.   Approximate
 type of mode
 cm-1   Med.   Method   References

a' 2 Bend 537 ± 1 gas LF Trkula and Harris, 1983
Tao, Mukarakate, et al., 2007
2 Bend 533.6 Ar IR Kauffman, Hauge, et al., 1985
3 CuO stretch 635 gas LF Tao, Mukarakate, et al., 2007
3 CuO stretch 635.1 Ar IR Kauffman, Hauge, et al., 1985

Trkula and Harris, 1983
Trkula, M.; Harris, D.O., Laser spectroscopy of the 1A´´--X 1A´ system of CuOH and CuOD, J. Chem. Phys., 1983, 79, 3, 1138, https://doi.org/10.1063/1.445916 . [all data]

Jarman, Fernando, et al., 1990
Jarman, C.N.; Fernando, W.T.M.L.; Bernath, P.F., Further analysis of the system of CuOH and CuOD, J. Mol. Spectrosc., 1990, 144, 2, 286, https://doi.org/10.1016/0022-2852(90)90215-C . [all data]

Tao, Mukarakate, et al., 2007
Tao, C.; Mukarakate, C.; Reid, S.A., Single vibronic level emission spectroscopy and fluorescence lifetime of the system of CuOH and CuOD, Chem. Phys. Lett., 2007, 449, 4-6, 282, https://doi.org/10.1016/j.cplett.2007.10.084 . [all data]

Jarman, Fernando, et al., 1991
Jarman, C.N.; Fernando, W.T.M.L.; Bernath, P.F., Laser spectroscopy of the system of CuOH and CuOD, J. Mol. Spectrosc., 1991, 145, 1, 151, https://doi.org/10.1016/0022-2852(91)90359-I . [all data]

Kauffman, Hauge, et al., 1985
Kauffman, J.W.; Hauge, R.H.; Margrave, J.L., Studies of reactions of atomic and diatomic chromium, manganese, iron, cobalt, nickel, copper, and zinc with molecular water at 15 K, J. Phys. Chem., 1985, 89, 16, 3541, https://doi.org/10.1021/j100262a023 . [all data]