Ta3

Vibrational and/or electronic energy levels

Data compiled by: Marilyn E. Jacox

State:   X

Vib.
sym.
 No.   Approximate
 type of mode
 cm-1   Med.   Method   References

1 Sym. stretch 251.2 Ar Ra Fang, Shen, et al., 2000

Additional references: Jacox, 2003, page 51

References

Fang, Shen, et al., 2000
Fang, L.; Shen, X.; Chen, X.; Lombardi, J.R., Raman spectra of ruthenium and tantalum trimers in argon matrices, Chem. Phys. Lett., 2000, 332, 3-4, 299, https://doi.org/10.1016/S0009-2614(00)01260-4 . [all data]

Jacox, 2003
Jacox, M.E., Vibrational and electronic energy levels of polyatomic transient molecules: supplement B, J. Phys. Chem. Ref. Data, 2003, 32, 1, 1-441, https://doi.org/10.1063/1.1497629 . [all data]