Sn3

Vibrational and/or electronic energy levels

Data compiled by: Marilyn E. Jacox

State:   D

 Energy
 (cm-1
 Med.   Transition   λmin
 (nm)
 λmax
 (nm)

References

To = 5890 ± 800 gas Moravec, Klopcic, et al., 1999

State:   C

 Energy
 (cm-1
 Med.   Transition   λmin
 (nm)
 λmax
 (nm)

To = 5400 ± 80 gas Moravec, Klopcic, et al., 1999

State:   B

 Energy
 (cm-1
 Med.   Transition   λmin
 (nm)
 λmax
 (nm)

To = 2980 ± 160 gas Moravec, Klopcic, et al., 1999

State:   A

 Energy
 (cm-1
 Med.   Transition   λmin
 (nm)
 λmax
 (nm)

To = 890 ± 110 gas Moravec, Klopcic, et al., 1999

Additional references: Jacox, 2003, page 84

Moravec, Klopcic, et al., 1999
Moravec, V.D.; Klopcic, S.A.; Jarrold, C.C., Anion photoelectron spectroscopy of small tin clusters, J. Chem. Phys., 1999, 110, 11, 5079, https://doi.org/10.1063/1.478405 . [all data]

Jacox, 2003
Jacox, M.E., Vibrational and electronic energy levels of polyatomic transient molecules: supplement B, J. Phys. Chem. Ref. Data, 2003, 32, 1, 1-441, https://doi.org/10.1063/1.1497629 . [all data]