Si7-

Vibrational and/or electronic energy levels

Data compiled by: Marilyn E. Jacox

State:   ?

 Energy
 (cm-1
 Med.   Transition   λmin
 (nm)
 λmax
 (nm)

References

Td = 14930 ± 160 gas Xu, Taylor, et al., 1998

Additional references: Jacox, 2003, page 344

Xu, Taylor, et al., 1998
Xu, C.; Taylor, T.R.; Burton, G.R.; Neumark, D.M., Vibrationally resolved photoelectron spectroscopy of silicon cluster anions Si[sub n][sup -] (n=3--7), J. Chem. Phys., 1998, 108, 4, 1395, https://doi.org/10.1063/1.475511 . [all data]

Jacox, 2003
Jacox, M.E., Vibrational and electronic energy levels of polyatomic transient molecules: supplement B, J. Phys. Chem. Ref. Data, 2003, 32, 1, 1-441, https://doi.org/10.1063/1.1497629 . [all data]