Sb5 (D5h)

Vibrational and/or electronic energy levels

Data compiled by: Marilyn E. Jacox

State:   D

 Energy
 (cm-1
 Med.   Transition   λmin
 (nm)
 λmax
 (nm)

References

Tx = 16300 ± 400 gas Zhai, Wang, et al., 2002

State:   C

 Energy
 (cm-1
 Med.   Transition   λmin
 (nm)
 λmax
 (nm)

Tx = 13550 ± 400 gas Zhai, Wang, et al., 2002

State:   B

 Energy
 (cm-1
 Med.   Transition   λmin
 (nm)
 λmax
 (nm)

Tx = 9600 ± 470 gas Zhai, Wang, et al., 2002

State:   A

 Energy
 (cm-1
 Med.   Transition   λmin
 (nm)
 λmax
 (nm)

Tx = 4115 ± 290 gas Zhai, Wang, et al., 2002

State:   X'

 Energy
 (cm-1
 Med.   Transition   λmin
 (nm)
 λmax
 (nm)

Tx = 1130 ± 340 gas Zhai, Wang, et al., 2002

Zhai, Wang, et al., 2002
Zhai, H.-J.; Wang, L.-S.; Kuznetsov, A.E.; Boldyrev, A.I., Probing the Electronic Structure and Aromaticity of Pentapnictogen Cluster Anions Pn, J. Phys. Chem. A, 2002, 106, 23, 5600, https://doi.org/10.1021/jp020115k . [all data]