Sb5 (C2v)

Vibrational and/or electronic energy levels

Data compiled by: Marilyn E. Jacox

State:   G

 Energy
 (cm-1
 Med.   Transition   λmin
 (nm)
 λmax
 (nm)

References

Tx = 31300 ± 470 gas Zhai, Wang, et al., 2002

State:   F

 Energy
 (cm-1
 Med.   Transition   λmin
 (nm)
 λmax
 (nm)

Tx = 29930 ± 470 gas Zhai, Wang, et al., 2002

State:   E

 Energy
 (cm-1
 Med.   Transition   λmin
 (nm)
 λmax
 (nm)

Tx = 23880 ± 470 gas Zhai, Wang, et al., 2002

State:   D

 Energy
 (cm-1
 Med.   Transition   λmin
 (nm)
 λmax
 (nm)

Tx = 19770 ± 470 gas Zhai, Wang, et al., 2002

State:   C

 Energy
 (cm-1
 Med.   Transition   λmin
 (nm)
 λmax
 (nm)

Tx = 18800 ± 470 gas Zhai, Wang, et al., 2002

State:   B

 Energy
 (cm-1
 Med.   Transition   λmin
 (nm)
 λmax
 (nm)

Tx = 14760 ± 290 gas Zhai, Wang, et al., 2002

State:   A

 Energy
 (cm-1
 Med.   Transition   λmin
 (nm)
 λmax
 (nm)

Tx = 9520 ± 290 gas Zhai, Wang, et al., 2002

Zhai, Wang, et al., 2002
Zhai, H.-J.; Wang, L.-S.; Kuznetsov, A.E.; Boldyrev, A.I., Probing the Electronic Structure and Aromaticity of Pentapnictogen Cluster Anions Pn, J. Phys. Chem. A, 2002, 106, 23, 5600, https://doi.org/10.1021/jp020115k . [all data]