SThS

Vibrational and/or electronic energy levels

Data compiled by: Marilyn E. Jacox

State:   X

Vib.
sym.
 No.   Approximate
 type of mode
 cm-1   Med.   Method   References

a1 1 Sym. stretch 451.4 Ar IR Liang and Andrews, 2002
b2 3 Asym. stretch 431.5 Ar IR Liang and Andrews, 2002

References

Liang and Andrews, 2002
Liang, B.; Andrews, L., Matrix Infrared Spectra and Quasirelativistic DFT Studies of ThS and ThS, J. Phys. Chem. A, 2002, 106, 16, 4038, https://doi.org/10.1021/jp014301m . [all data]