STaS

Vibrational and/or electronic energy levels

Data compiled by: Marilyn E. Jacox

State:   X

Vib.
sym.
 No.   Approximate
 type of mode
 cm-1   Med.   Method   References

a1 1 Sym. stretch 523.4 Ar IR Liang and Andrews, 2002
b2 3 Asym. stretch 516.5 Ar IR Liang and Andrews, 2002

References

Liang and Andrews, 2002
Liang, B.; Andrews, L., Infrared Spectra and Density Functional Theory Calculations of Group V Transition Metal Sulfides, J. Phys. Chem. A, 2002, 106, 15, 3738, https://doi.org/10.1021/jp013790n . [all data]