(cyc-O2Ru)O2

Vibrational and/or electronic energy levels

Data compiled by: Marilyn E. Jacox

State:   X

Vib.
sym.
 No.   Approximate
 type of mode
 cm-1   Med.   Method   References

ORuO s-stretch 946.9 Ne IR Zhou, Citra, et al., 2000
ORuO s-stretch 940.2 Ar IR Zhou, Citra, et al., 2000
ORuO a-stretch 928.5 Ne IR Zhou, Citra, et al., 2000
ORuO a-stretch 920.7 Ar IR Zhou, Citra, et al., 2000

Additional references: Jacox, 2003, page 297

References

Zhou, Citra, et al., 2000
Zhou, M.; Citra, A.; Liang, B.; Andrews, L., Infrared Spectra and Density Functional Calculations of MO, J. Phys. Chem. A, 2000, 104, 16, 3457, https://doi.org/10.1021/jp993026p . [all data]

Jacox, 2003
Jacox, M.E., Vibrational and electronic energy levels of polyatomic transient molecules: supplement B, J. Phys. Chem. Ref. Data, 2003, 32, 1, 1-441, https://doi.org/10.1063/1.1497629 . [all data]