OSOO

Vibrational and/or electronic energy levels

Data compiled by: Marilyn E. Jacox

State:   X

Vib.
sym.
 No.   Approximate
 type of mode
 cm-1   Med.   Method   References

OS stretch 1229.6 Ar IR Jou, Shen, et al., 1996
OO stretch 1041.3 Ar IR Jou, Shen, et al., 1996
597.6 Ar IR Jou, Shen, et al., 1996

Additional references: Jacox, 1998, page 260

References

Jou, Shen, et al., 1996
Jou, S.-H.; Shen, M.-Y.; Yu, C.-H.; Lee, Y.-P., Isomers of SO3: Infrared absorption of OSOO in solid argon, J. Chem. Phys., 1996, 104, 15, 5745, https://doi.org/10.1063/1.471335 . [all data]

Jacox, 1998
Jacox, M.E., Vibrational and electronic energy levels of polyatomic transient molecules: supplement A, J. Phys. Chem. Ref. Data, 1998, 27, 2, 115-393, https://doi.org/10.1063/1.556017 . [all data]