OWO-

Vibrational and/or electronic energy levels

Data compiled by: Marilyn E. Jacox

State:   ?

 Energy
 (cm-1
 Med.   Transition   λmin
 (nm)
 λmax
 (nm)

References

Td = 16120 ± 80 U gas Davico, Schwartz, et al., 1999

State:   X

Vib.
sym.
 No.   Approximate
 type of mode
 cm-1   Med.   Method   References

a1 1 Sym. stretch 952.3 Ne IR Zhou and Andrews, 1999
1 Sym. stretch 946.3 Ar IR Zhou and Andrews, 1999
b2 3 Asym. stretch 887.8 Ne IR Zhou and Andrews, 1999
3 Asym. stretch 880.0 Ar IR Zhou and Andrews, 1999

Additional references: Jacox, 2003, page 117

Davico, Schwartz, et al., 1999
Davico, G.E.; Schwartz, R.L.; Ramond, T.M.; Lineberger, W.C., An Experimental Study of the Low-lying Electron States of WO2, J. Phys. Chem. A, 1999, 103, 31, 6167, https://doi.org/10.1021/jp9911752 . [all data]

Zhou and Andrews, 1999
Zhou, M.; Andrews, L., Infrared spectra and density functional calculations of the CrO[sub 2][sup -], MoO[sub 2][sup -], and WO[sub 2][sup -] molecular anions in solid neon, J. Chem. Phys., 1999, 111, 9, 4230, https://doi.org/10.1063/1.479721 . [all data]

Jacox, 2003
Jacox, M.E., Vibrational and electronic energy levels of polyatomic transient molecules: supplement B, J. Phys. Chem. Ref. Data, 2003, 32, 1, 1-441, https://doi.org/10.1063/1.1497629 . [all data]