cyc-(VO)2

Vibrational and/or electronic energy levels

Data compiled by: Marilyn E. Jacox

State:   X

Vib.
sym.
 No.   Approximate
 type of mode
 cm-1   Med.   Method   References

668.1 Ar IR Chertihin, Bare, et al., 1997
504.3 Ar IR Chertihin, Bare, et al., 1997

Additional references: Jacox, 2003, page 211

References

Chertihin, Bare, et al., 1997
Chertihin, G.V.; Bare, W.D.; Andrews, L., Reactions of Laser-Ablated Vanadium Atoms with Dioxygen. Infrared Spectra of VO, VO, J. Phys. Chem. A, 1997, 101, 28, 5090, https://doi.org/10.1021/jp970559u . [all data]

Jacox, 2003
Jacox, M.E., Vibrational and electronic energy levels of polyatomic transient molecules: supplement B, J. Phys. Chem. Ref. Data, 2003, 32, 1, 1-441, https://doi.org/10.1063/1.1497629 . [all data]