OUO-

Vibrational and/or electronic energy levels

Data compiled by: Marilyn E. Jacox

State:   X

Vib.
sym.
 No.   Approximate
 type of mode
 cm-1   Med.   Method   References

Σu+ 3 Asym. stretch 857.2 Ne IR Zhou, Andrews, et al., 2000

Additional references: Jacox, 2003, page 120

References

Zhou, Andrews, et al., 2000
Zhou, M.; Andrews, L.; Ismail, N.; Marsden, C., Infrared Spectra of UO, J. Phys. Chem. A, 2000, 104, 23, 5495, https://doi.org/10.1021/jp000292q . [all data]

Jacox, 2003
Jacox, M.E., Vibrational and electronic energy levels of polyatomic transient molecules: supplement B, J. Phys. Chem. Ref. Data, 2003, 32, 1, 1-441, https://doi.org/10.1063/1.1497629 . [all data]