OScO-

Vibrational and/or electronic energy levels

Data compiled by: Marilyn E. Jacox

State:   ?

 Energy
 (cm-1
 Med.   Transition   λmin
 (nm)
 λmax
 (nm)

References

Td = 18720 ± 160 gas Wu and Wang, 1998

State:   X

Vib.
sym.
 No.   Approximate
 type of mode
 cm-1   Med.   Method   References

b2 3 ScO2 a-stretch 722.5 Ar IR Chertihin, Andrews, et al., 1997
Bauschlicher, Zhou, et al., 1999
3 ScO2 a-stretch 705.4 N2 IR Chertihin, Andrews, et al., 1997
Bauschlicher, Zhou, et al., 1999

Additional references: Jacox, 2003, page 116

Wu and Wang, 1998
Wu, H.; Wang, L.-S., Photoelectron Spectroscopy and Electronic Structure of ScO, J. Phys. Chem. A, 1998, 102, 46, 9129, https://doi.org/10.1021/jp982588q . [all data]

Chertihin, Andrews, et al., 1997
Chertihin, G.V.; Andrews, L.; Rosi, M.; Bauschlicher, C.W., Jr., Reactions of Laser-Ablated Scandium Atoms with Dioxygen. Infrared Spectra of ScO, OScO, (O, J. Phys. Chem. A, 1997, 101, 48, 9085, https://doi.org/10.1021/jp972482f . [all data]

Bauschlicher, Zhou, et al., 1999
Bauschlicher, C.W., Jr.; Zhou, M.; Andrews, L.; Tobias Johnson, J.R.; Panas, I.; Snis, A.; Roos, B.O., A Further Study of the Products of Scandium and Dioxygen Reactions, J. Phys. Chem. A, 1999, 103, 28, 5463, https://doi.org/10.1021/jp9908808 . [all data]

Jacox, 2003
Jacox, M.E., Vibrational and electronic energy levels of polyatomic transient molecules: supplement B, J. Phys. Chem. Ref. Data, 2003, 32, 1, 1-441, https://doi.org/10.1063/1.1497629 . [all data]