cyc-ScO2+

Vibrational and/or electronic energy levels

Data compiled by: Marilyn E. Jacox

State:   X

Vib.
sym.
 No.   Approximate
 type of mode
 cm-1   Med.   Method   References

a1 1 OO stretch 892.9 Ar IR Bauschlicher, Zhou, et al., 1999
2 OScO s-stretch 641.1 Ar IR Bauschlicher, Zhou, et al., 1999
b2 3 OScO a-stretch 624.8 Ar IR Bauschlicher, Zhou, et al., 1999

Additional references: Jacox, 2003, page 96

References

Bauschlicher, Zhou, et al., 1999
Bauschlicher, C.W., Jr.; Zhou, M.; Andrews, L.; Tobias Johnson, J.R.; Panas, I.; Snis, A.; Roos, B.O., A Further Study of the Products of Scandium and Dioxygen Reactions, J. Phys. Chem. A, 1999, 103, 28, 5463, https://doi.org/10.1021/jp9908808 . [all data]

Jacox, 2003
Jacox, M.E., Vibrational and electronic energy levels of polyatomic transient molecules: supplement B, J. Phys. Chem. Ref. Data, 2003, 32, 1, 1-441, https://doi.org/10.1063/1.1497629 . [all data]