OPdO-

Vibrational and/or electronic energy levels

Data compiled by: Marilyn E. Jacox

State:   ?

 Energy
 (cm-1
 Med.   Transition   λmin
 (nm)
 λmax
 (nm)

References

Td = 24900 ± 40 gas Ramond, Davico, et al., 2002

Ramond, Davico, et al., 2002
Ramond, T.M.; Davico, G.E.; Hellberg, F.; Svedberg, F.; Salen, P.; Soderqvist, P.; Lineberger, W.C., Photoelectron Spectroscopy of Nickel, Palladium, and Platinum Oxide Anions, J. Mol. Spectrosc., 2002, 216, 1, 1, https://doi.org/10.1006/jmsp.2002.8669 . [all data]