cyc-PbO2

Vibrational and/or electronic energy levels

Data compiled by: Marilyn E. Jacox

State:   X

Vib.
sym.
 No.   Approximate
 type of mode
 cm-1   Med.   Method   References

a1 1 OO stretch 728.7 Ar IR Konnov, Serebrennikov, et al., 1982
Chertihin and Andrews, 1996
1 OO stretch 730.6 N2 IR Chertihin and Andrews, 1996
2 PbO stretch 437.3 Ar IR Konnov, Serebrennikov, et al., 1982
Chertihin and Andrews, 1996
2 PbO stretch 449.6 N2 IR Chertihin and Andrews, 1996

Additional references: Jacox, 1998, page 190

References

Konnov, Serebrennikov, et al., 1982
Konnov, S.A.; Serebrennikov, L.V.; Mal'tsev, A.A., Zh. Neorg. Khim., 1982, 27, 323. [all data]

Chertihin and Andrews, 1996
Chertihin, G.V.; Andrews, L., Infrared spectra of the reaction products of laser ablated lead atoms and oxygen molecules in condensing argon and nitrogen, J. Chem. Phys., 1996, 105, 7, 2561, https://doi.org/10.1063/1.472122 . [all data]

Jacox, 1998
Jacox, M.E., Vibrational and electronic energy levels of polyatomic transient molecules: supplement A, J. Phys. Chem. Ref. Data, 1998, 27, 2, 115-393, https://doi.org/10.1063/1.556017 . [all data]