Ta3O-

Vibrational and/or electronic energy levels

Data compiled by: Marilyn E. Jacox

State:   ?

 Energy
 (cm-1
 Med.   Transition   λmin
 (nm)
 λmax
 (nm)

References

Td = 12770 ± 80 gas Green, Alex, et al., 2001

State:   X

Vib.
sym.
 No.   Approximate
 type of mode
 cm-1   Med.   Method   References

a1 3 215 ± 20 gas PE Green, Alex, et al., 2001

Additional references: Jacox, 2003, page 201

Green, Alex, et al., 2001
Green, S.M.E.; Alex, S.; Fleischer, N.L.; Millam, E.L.; Marcy, T.P.; Leopold, D.G., Negative ion photoelectron spectroscopy of the group 5 metal trimer monoxides V[sub 3]O, Nb[sub 3]O, and Ta[sub 3]O, J. Chem. Phys., 2001, 114, 6, 2653, https://doi.org/10.1063/1.1333003 . [all data]

Jacox, 2003
Jacox, M.E., Vibrational and electronic energy levels of polyatomic transient molecules: supplement B, J. Phys. Chem. Ref. Data, 2003, 32, 1, 1-441, https://doi.org/10.1063/1.1497629 . [all data]