SeSeO

Vibrational and/or electronic energy levels

Data compiled by: Marilyn E. Jacox

State:   X

Vib.
sym.
 No.   Approximate
 type of mode
 cm-1   Med.   Method   References

a' 1 SeO stretch 883.2 Ar IR Brabson, Andrews, et al., 1996

Additional references: Jacox, 1998, page 201

References

Brabson, Andrews, et al., 1996
Brabson, G.D.; Andrews, L.; Marsden, C.J., Reactions of Selenium and Oxygen. Matrix Infrared Spectra and Density Functional Calculations of Novel Se, J. Phys. Chem., 1996, 100, 41, 16487, https://doi.org/10.1021/jp961388g . [all data]

Jacox, 1998
Jacox, M.E., Vibrational and electronic energy levels of polyatomic transient molecules: supplement A, J. Phys. Chem. Ref. Data, 1998, 27, 2, 115-393, https://doi.org/10.1063/1.556017 . [all data]