ONiOO

Vibrational and/or electronic energy levels

Data compiled by: Marilyn E. Jacox

State:   X

Vib.
sym.
 No.   Approximate
 type of mode
 cm-1   Med.   Method   References

OO stretch 1393.7 Ar IR Citra, Chertihin, et al., 1997

Additional references: Jacox, 1998, page 251

References

Citra, Chertihin, et al., 1997
Citra, A.; Chertihin, G.V.; Andrews, L.; Neurock, M., Reactions of Laser-Ablated Nickel Atoms with Dioxygen. Infrared Spectra and Density Functional Calculations of Nickel Oxides NiO, ONiO, Ni, J. Phys. Chem. A, 1997, 101, 17, 3109, https://doi.org/10.1021/jp970019x . [all data]

Jacox, 1998
Jacox, M.E., Vibrational and electronic energy levels of polyatomic transient molecules: supplement A, J. Phys. Chem. Ref. Data, 1998, 27, 2, 115-393, https://doi.org/10.1063/1.556017 . [all data]