ONbO-

Vibrational and/or electronic energy levels

Data compiled by: Marilyn E. Jacox

State:   X

Vib.
sym.
 No.   Approximate
 type of mode
 cm-1   Med.   Method   References

b2 3 Asym. stretch 854.1 Ar IR Zhou and Andrews, 1998

Additional references: Jacox, 2003, page 117

References

Zhou and Andrews, 1998
Zhou, M.; Andrews, L., Reactions of Laser-Ablated Niobium and Tantalum Atoms with Oxygen Molecules: Infrared Spectra of Niobium and Tantalum Oxide Molecules, Anions, and Cations, J. Phys. Chem. A, 1998, 102, 43, 8251, https://doi.org/10.1021/jp982212c . [all data]

Jacox, 2003
Jacox, M.E., Vibrational and electronic energy levels of polyatomic transient molecules: supplement B, J. Phys. Chem. Ref. Data, 2003, 32, 1, 1-441, https://doi.org/10.1063/1.1497629 . [all data]