NNPtNN

Vibrational and/or electronic energy levels

Data compiled by: Marilyn E. Jacox

State:   X

Vib.
sym.
 No.   Approximate
 type of mode
 cm-1   Med.   Method   References

NN stretch 2206.9 Ne IR Citra, Wang, et al., 2001
NN stretch 2195.4 Ar IR Green, Thomas, et al., 1973
Citra, Wang, et al., 2001
NN stretch 2205.7 N2 IR Green, Thomas, et al., 1973
Citra, Wang, et al., 2001

Additional references: Jacox, 2003, page 287

References

Citra, Wang, et al., 2001
Citra, A.; Wang, X.; Bare, W.D.; Andrews, L., Reactions of Laser-Ablated Platinum with Nitrogen: Matrix Infrared Spectra of Platinum Nitride, Complexes, and Anions, J. Phys. Chem. A, 2001, 105, 33, 7799, https://doi.org/10.1021/jp011542l . [all data]

Green, Thomas, et al., 1973
Green, D.W.; Thomas, J.; Gruen, D.M., Infrared identification of the Pt(N2) and Pt(N2)2 complexes in low temperature matrices, J. Chem. Phys., 1973, 58, 12, 5453, https://doi.org/10.1063/1.1679165 . [all data]

Jacox, 2003
Jacox, M.E., Vibrational and electronic energy levels of polyatomic transient molecules: supplement B, J. Phys. Chem. Ref. Data, 2003, 32, 1, 1-441, https://doi.org/10.1063/1.1497629 . [all data]