Ta(NO)3

Vibrational and/or electronic energy levels

Data compiled by: Marilyn E. Jacox

State:   X

Vib.
sym.
 No.   Approximate
 type of mode
 cm-1   Med.   Method   References

NO stretch 1676.9 Ar IR Zhou and Andrews, 1998

Additional references: Jacox, 2003, page 346

References

Zhou and Andrews, 1998
Zhou, M.; Andrews, L., Reactions of Laser-Ablated Niobium and Tantalum Atoms with NO. Infrared Spectra of the NMO, M(η, J. Phys. Chem. A, 1998, 102, 49, 10025, https://doi.org/10.1021/jp983392t . [all data]

Jacox, 2003
Jacox, M.E., Vibrational and electronic energy levels of polyatomic transient molecules: supplement B, J. Phys. Chem. Ref. Data, 2003, 32, 1, 1-441, https://doi.org/10.1063/1.1497629 . [all data]