cyc-(YN)2+

Vibrational and/or electronic energy levels

Data compiled by: Marilyn E. Jacox

State:   X

Vib.
sym.
 No.   Approximate
 type of mode
 cm-1   Med.   Method   References

b2u 731.5 Ar IR Chertihin, Bare, et al., 1998

Additional references: Jacox, 2003, page 201

References

Chertihin, Bare, et al., 1998
Chertihin, G.V.; Bare, W.D.; Andrews, L., Reactions of Yttrium and Lanthanum Atoms with Nitrogen. Infrared Spectra of the Metal Nitrides and Dinitrogen Complexes in Solid Argon and Nitrogen, J. Phys. Chem. A, 1998, 102, 21, 3697, https://doi.org/10.1021/jp980871j . [all data]

Jacox, 2003
Jacox, M.E., Vibrational and electronic energy levels of polyatomic transient molecules: supplement B, J. Phys. Chem. Ref. Data, 2003, 32, 1, 1-441, https://doi.org/10.1063/1.1497629 . [all data]