cyc-TaN2

Vibrational and/or electronic energy levels

Data compiled by: Marilyn E. Jacox

State:   X

Vib.
sym.
 No.   Approximate
 type of mode
 cm-1   Med.   Method   References

a1 1 NN stretch 1762.6 N2 IR Zhou and Andrews, 1998

Additional references: Jacox, 2003, page 71

References

Zhou and Andrews, 1998
Zhou, M.; Andrews, L., Reactions of Laser-Ablated Niobium, Tantalum, and Rhenium Atoms with Nitrogen Atoms and Molecules. Infrared Spectra and Density Functional Calculations of the Metal Nitride and Dinitride Molecules, J. Phys. Chem. A, 1998, 102, 45, 9061, https://doi.org/10.1021/jp982814w . [all data]

Jacox, 2003
Jacox, M.E., Vibrational and electronic energy levels of polyatomic transient molecules: supplement B, J. Phys. Chem. Ref. Data, 2003, 32, 1, 1-441, https://doi.org/10.1063/1.1497629 . [all data]