cyc-(SiN)2

Vibrational and/or electronic energy levels

Data compiled by: Marilyn E. Jacox

State:   X

Vib.
sym.
 No.   Approximate
 type of mode
 cm-1   Med.   Method   References

b2 SiN stretch 900.9 N2 IR Maier, Reisenauer, et al., 2000

Additional references: Jacox, 2003, page 223

References

Maier, Reisenauer, et al., 2000
Maier, G.; Reisenauer, H.P.; Glatthaar, J., Reactions of Silicon Atoms with Nitrogen: A Combined Matrix Spectroscopic and Density Functional Theory Study, Organomet., 2000, 19, 23, 4775, https://doi.org/10.1021/om000234r . [all data]

Jacox, 2003
Jacox, M.E., Vibrational and electronic energy levels of polyatomic transient molecules: supplement B, J. Phys. Chem. Ref. Data, 2003, 32, 1, 1-441, https://doi.org/10.1063/1.1497629 . [all data]