NRuN

Vibrational and/or electronic energy levels

Data compiled by: Marilyn E. Jacox

State:   X

Vib.
sym.
 No.   Approximate
 type of mode
 cm-1   Med.   Method   References

b2 3 Asym. stretch 831.9 Ar IR Citra and Andrews, 1999
Citra and Andrews, 2000
3 Asym. stretch 831.5 N2 IR Citra and Andrews, 2000

Additional references: Jacox, 2003, page 72

References

Citra and Andrews, 1999
Citra, A.; Andrews, L., Matrix Infrared Spectra of the Osmium and Ruthenium Dinitride Molecules. Evidence for Direct Insertion of Osmium into the Dinitrogen Bond at Cryogenic Temperatures, J. Am. Chem. Soc., 1999, 121, 49, 11567, https://doi.org/10.1021/ja993211g . [all data]

Citra and Andrews, 2000
Citra, A.; Andrews, L., Reactions of Laser-Ablated Osmium and Ruthenium Atoms with Nitrogen. Matrix Infrared Spectra and Density Functional Calculations of Osmium and Ruthenium Nitrides and Dinitrides, J. Phys. Chem. A, 2000, 104, 6, 1152, https://doi.org/10.1021/jp993338s . [all data]

Jacox, 2003
Jacox, M.E., Vibrational and electronic energy levels of polyatomic transient molecules: supplement B, J. Phys. Chem. Ref. Data, 2003, 32, 1, 1-441, https://doi.org/10.1063/1.1497629 . [all data]