cyc-(RhN)2

Vibrational and/or electronic energy levels

Data compiled by: Marilyn E. Jacox

State:   X

Vib.
sym.
 No.   Approximate
 type of mode
 cm-1   Med.   Method   References

748.1 Ar IR Citra and Andrews, 1999
756.7 N2 IR Citra and Andrews, 1999

Additional references: Jacox, 2003, page 205

References

Citra and Andrews, 1999
Citra, A.; Andrews, L., Reactions of Laser Ablated Rhodium Atoms with Nitrogen Atoms and Molecules. Infrared Spectra and Density Functional Calculations on Rhodium Nitrides and Dinitrogen Complexes, J. Phys. Chem. A, 1999, 103, 18, 3410, https://doi.org/10.1021/jp9846274 . [all data]

Jacox, 2003
Jacox, M.E., Vibrational and electronic energy levels of polyatomic transient molecules: supplement B, J. Phys. Chem. Ref. Data, 2003, 32, 1, 1-441, https://doi.org/10.1063/1.1497629 . [all data]