RhNN-

Vibrational and/or electronic energy levels

Data compiled by: Marilyn E. Jacox

State:   X

Vib.
sym.
 No.   Approximate
 type of mode
 cm-1   Med.   Method   References

NN stretch 1957.4 Ne IR Wang and Andrews, 2002
NN stretch 1958.5 Ar IR Wang and Andrews, 2002

References

Wang and Andrews, 2002
Wang, X.; Andrews, L., Rhodium Dinitrogen Complexes Rh(NN), J. Phys. Chem. A, 2002, 106, 11, 2457, https://doi.org/10.1021/jp013527m . [all data]